{"text_format":"1","workbook":"xlsx","n_sheets":3,"sheets":["Dashboard","Logsheet","Standards"],"not_rendered":{"charts":4,"images":1,"macros":1,"external_links":0,"defined_names":14,"comments":0,"pivot_tables":0},"unopened":[],"bounds":{"document_bytes":16777216,"sheet_cells":100000,"rows_first":2000,"rows_last":500,"rows_between":2000,"halvings":0,"cell_chars":16384,"cell_head_chars":4096},"cells_cut":0,"cells_raw":0,"read":"whole","date_system":"1900"}

{"sheet":"Dashboard","index":0,"n_rows":13,"n_cols":16,"rows_kept":13,"cut":false,"hidden":false,"merged":[[10,3,10,5],[11,3,11,5],[12,3,12,5],[1,15,1,20],[2,15,2,20]]}
[]
[null,null,null,null,null,null,null,null,null,null,null,null,null,null,"Candidate Name:","John Mancinelli"]
[null,null,null,null,null,null,null,null,null,null,null,null,null,null,"Internship Site:","Hanford High School"]
[]
[]
[]
[]
[]
[]
[null,"Minimum Hours",540,"w/Students and/or Staff"]
[null,"Current Hours",{"$f":"SUM(Req_Hours)","v":14.5},"w/Students and/or Staff"]
[null,"Other Hours",{"$f":"SUM(Hours)-SUM(Req_Hours)","v":2},"non student/staff"]
[null,"Total Hours",{"$f":"SUM(C11:C12)","v":16.5},"Both"]

{"sheet":"Logsheet","index":1,"n_rows":1000,"n_cols":9,"rows_kept":1000,"cut":false,"hidden":false,"merged":[]}
["Date","Hours","Staff or Students Present","Req Hours","Activity Description","Role","NELP","WA State Standards","Graph"]
["2024-06-18",1,"Yes",{"$f":"IF(C2=\"Yes\",B2,0)","v":1},"Staff Meeting","Support","NELP1:Mission, Vision, and Improvement",null,{"$f":"IF(LEN(H2)=0,G2,H2)","v":"NELP1:Mission, Vision, and Improvement"}]
["2024-06-18",4,"Yes",{"$f":"IF(C3=\"Yes\",B3,0)","v":4},"Professional Development: SEL curriculum development","Lead","NELP2:Ethics and Profesisonal Norms","CCDEI2:Student, Family, and Community Engagement",{"$f":"IF(LEN(H3)=0,G3,H3)","v":"CCDEI2:Student, Family, and Community Engagement"}]
["2024-06-19",2,"Yes",2,"Discipline","Lead","NELP6:Operations and Management",null,"NELP6:Operations and Management"]
["2024-06-19",4,"Yes",4,"Curriculum workshop on SEL at 3rd Grade","Support","NELP7:Building Professional Capacity","SEL6:Social Engagement","SEL6:Social Engagement"]
["2024-06-20",3,"Yes",3,"Suppervision","Lead","NELP6:Operations and Management",null,"NELP6:Operations and Management"]
["2024-06-20",2,"No",0,"Professional Development Planning","Lead","NELP4:Learning and Instruction","STI:Since Time Immemorial","STI:Since Time Immemorial"]
[null,null,null,0,null,null,null,null,0]
["2024-06-21",0.25,"Yes",0.25,"Staff Meeting: End-of-year Planning","Lead","NELP6:Operations and Management",null,"NELP6:Operations and Management"]
["2024-06-21",0.25,"Yes",0.25,"Staff Meeting: SEL Events","Lead","NELP3:Equity, Inclusiveness, and Cultural Responsiveness","SEL2:Self-Management","SEL2:Self-Management"]
[null,null,null,0,null,null,null,null,0]
[null,null,null,0,null,null,null,null,0]
[null,null,null,0,null,null,null,null,0]
[null,null,null,0,null,null,null,null,0]
[null,null,null,0,null,null,null,null,0]
[null,null,null,0,null,null,null,null,0]
[null,null,null,0,null,null,null,null,0]
[null,null,null,0,null,null,null,null,0]
[null,null,null,0,null,null,null,null,0]
[null,null,null,0,null,null,null,null,0]
[null,null,null,0,null,null,null,null,0]
[null,null,null,0,null,null,null,null,0]
[null,null,null,0,null,null,null,null,0]
[null,null,null,0,null,null,null,null,0]
[null,null,null,0,null,null,null,null,0]
[null,null,null,0,null,null,null,null,0]
[null,null,null,0,null,null,null,null,0]
[null,null,null,0,null,null,null,null,0]
[null,null,null,0,null,null,null,null,0]
[null,null,null,0,null,null,null,null,0]
[null,null,null,0,null,null,null,null,0]
[null,null,null,0,null,null,null,null,0]
[null,null,null,0,null,null,null,null,0]
[null,null,null,0,null,null,null,null,0]
[null,null,null,0,null,null,null,null,0]
[null,null,null,0,null,null,null,null,0]
[null,null,null,0,null,null,null,null,0]
[null,null,null,0,null,null,null,null,0]
[null,null,null,0,null,null,null,null,0]
[null,null,null,0,null,null,null,null,0]
[null,null,null,0,null,null,null,null,0]
[null,null,null,0,null,null,null,null,0]
[null,null,null,0,null,null,null,null,0]
[null,null,null,0,null,null,null,null,0]
[null,null,null,0,null,null,null,null,0]
[null,null,null,0,null,null,null,null,0]
[null,null,null,0,null,null,null,null,0]
[null,null,null,0,null,null,null,null,0]
[null,null,null,0,null,null,null,null,0]
[null,null,null,0,null,null,null,null,0]
[null,null,null,0,null,null,null,null,0]
[null,null,null,0,null,null,null,null,0]
[null,null,null,0,null,null,null,null,0]
[null,null,null,0,null,null,null,null,0]
[null,null,null,0,null,null,null,null,0]
[null,null,null,0,null,null,null,null,0]
[null,null,null,0,null,null,null,null,0]
[null,null,null,0,null,null,null,null,0]
[null,null,null,0,null,null,null,null,0]
[null,null,null,0,null,null,null,null,0]
[null,null,null,0,null,null,null,null,0]
[null,null,null,0,null,null,null,null,0]
[null,null,null,0,null,null,null,null,0]
[null,null,null,0,null,null,null,null,0]
[null,null,null,0,null,null,null,null,0]
[null,null,null,0,null,null,null,null,0]
[null,null,null,{"$f":"IF(C67=\"Yes\",B67,0)","v":0},null,null,null,null,{"$f":"IF(LEN(H67)=0,G67,H67)","v":0}]
[null,null,null,0,null,null,null,null,0]
[null,null,null,0,null,null,null,null,0]
[null,null,null,0,null,null,null,null,0]
[null,null,null,0,null,null,null,null,0]
[null,null,null,0,null,null,null,null,0]
[null,null,null,0,null,null,null,null,0]
[null,null,null,0,null,null,null,null,0]
[null,null,null,0,null,null,null,null,0]
[null,null,null,0,null,null,null,null,0]
[null,null,null,0,null,null,null,null,0]
[null,null,null,0,null,null,null,null,0]
[null,null,null,0,null,null,null,null,0]
[null,null,null,0,null,null,null,null,0]
[null,null,null,0,null,null,null,null,0]
[null,null,null,0,null,null,null,null,0]
[null,null,null,0,null,null,null,null,0]
[null,null,null,0,null,null,null,null,0]
[null,null,null,0,null,null,null,null,0]
[null,null,null,0,null,null,null,null,0]
[null,null,null,0,null,null,null,null,0]
[null,null,null,0,null,null,null,null,0]
[null,null,null,0,null,null,null,null,0]
[null,null,null,0,null,null,null,null,0]
[null,null,null,0,null,null,null,null,0]
[null,null,null,0,null,null,null,null,0]
[null,null,null,0,null,null,null,null,0]
[null,null,null,0,null,null,null,null,0]
[null,null,null,0,null,null,null,null,0]
[null,null,null,0,null,null,null,null,0]
[null,null,null,0,null,null,null,null,0]
[null,null,null,0,null,null,null,null,0]
[null,null,null,0,null,null,null,null,0]
[null,null,null,0,null,null,null,null,0]
[null,null,null,0,null,null,null,null,0]
[null,null,null,0,null,null,null,null,0]
[null,null,null,0,null,null,null,null,0]
[null,null,null,0,null,null,null,null,0]
[null,null,null,0,null,null,null,null,0]
[null,null,null,0,null,null,null,null,0]
[null,null,null,0,null,null,null,null,0]
[null,null,null,0,null,null,null,null,0]
[null,null,null,0,null,null,null,null,0]
[null,null,null,0,null,null,null,null,0]
[null,null,null,0,null,null,null,null,0]
[null,null,null,0,null,null,null,null,0]
[null,null,null,0,null,null,null,null,0]
[null,null,null,0,null,null,null,null,0]
[null,null,null,0,null,null,null,null,0]
[null,null,null,0,null,null,null,null,0]
[null,null,null,0,null,null,null,null,0]
[null,null,null,0,null,null,null,null,0]
[null,null,null,0,null,null,null,null,0]
[null,null,null,0,null,null,null,null,0]
[null,null,null,0,null,null,null,null,0]
[null,null,null,0,null,null,null,null,0]
[null,null,null,0,null,null,null,null,0]
[null,null,null,0,null,null,null,null,0]
[null,null,null,0,null,null,null,null,0]
[null,null,null,0,null,null,null,null,0]
[null,null,null,0,null,null,null,null,0]
[null,null,null,0,null,null,null,null,0]
[null,null,null,0,null,null,null,null,0]
[null,null,null,0,null,null,null,null,0]
[null,null,null,{"$f":"IF(C131=\"Yes\",B131,0)","v":0},null,null,null,null,{"$f":"IF(LEN(H131)=0,G131,H131)","v":0}]
[null,null,null,0,null,null,null,null,0]
[null,null,null,0,null,null,null,null,0]
[null,null,null,0,null,null,null,null,0]
[null,null,null,0,null,null,null,null,0]
[null,null,null,0,null,null,null,null,0]
[null,null,null,0,null,null,null,null,0]
[null,null,null,0,null,null,null,null,0]
[null,null,null,0,null,null,null,null,0]
[null,null,null,0,null,null,null,null,0]
[null,null,null,0,null,null,null,null,0]
[null,null,null,0,null,null,null,null,0]
[null,null,null,0,null,null,null,null,0]
[null,null,null,0,null,null,null,null,0]
[null,null,null,0,null,null,null,null,0]
[null,null,null,0,null,null,null,null,0]
[null,null,null,0,null,null,null,null,0]
[null,null,null,0,null,null,null,null,0]
[null,null,null,0,null,null,null,null,0]
[null,null,null,0,null,null,null,null,0]
[null,null,null,0,null,null,null,null,0]
[null,null,null,0,null,null,null,null,0]
[null,null,null,0,null,null,null,null,0]
[null,null,null,0,null,null,null,null,0]
[null,null,null,0,null,null,null,null,0]
[null,null,null,0,null,null,null,null,0]
[null,null,null,0,null,null,null,null,0]
[null,null,null,0,null,null,null,null,0]
[null,null,null,0,null,null,null,null,0]
[null,null,null,0,null,null,null,null,0]
[null,null,null,0,null,null,null,null,0]
[null,null,null,0,null,null,null,null,0]
[null,null,null,0,null,null,null,null,0]
[null,null,null,0,null,null,null,null,0]
[null,null,null,0,null,null,null,null,0]
[null,null,null,0,null,null,null,null,0]
[null,null,null,0,null,null,null,null,0]
[null,null,null,0,null,null,null,null,0]
[null,null,null,0,null,null,null,null,0]
[null,null,null,0,null,null,null,null,0]
[null,null,null,0,null,null,null,null,0]
[null,null,null,0,null,null,null,null,0]
[null,null,null,0,null,null,null,null,0]
[null,null,null,0,null,null,null,null,0]
[null,null,null,0,null,null,null,null,0]
[null,null,null,0,null,null,null,null,0]
[null,null,null,0,null,null,null,null,0]
[null,null,null,0,null,null,null,null,0]
[null,null,null,0,null,null,null,null,0]
[null,null,null,0,null,null,null,null,0]
[null,null,null,0,null,null,null,null,0]
[null,null,null,0,null,null,null,null,0]
[null,null,null,0,null,null,null,null,0]
[null,null,null,0,null,null,null,null,0]
[null,null,null,0,null,null,null,null,0]
[null,null,null,0,null,null,null,null,0]
[null,null,null,0,null,null,null,null,0]
[null,null,null,0,null,null,null,null,0]
[null,null,null,0,null,null,null,null,0]
[null,null,null,0,null,null,null,null,0]
[null,null,null,0,null,null,null,null,0]
[null,null,null,0,null,null,null,null,0]
[null,null,null,0,null,null,null,null,0]
[null,null,null,0,null,null,null,null,0]
[null,null,null,{"$f":"IF(C195=\"Yes\",B195,0)","v":0},null,null,null,null,{"$f":"IF(LEN(H195)=0,G195,H195)","v":0}]
[null,null,null,0,null,null,null,null,0]
[null,null,null,0,null,null,null,null,0]
[null,null,null,0,null,null,null,null,0]
[null,null,null,0,null,null,null,null,0]
[null,null,null,0,null,null,null,null,0]
[null,null,null,0,null,null,null,null,0]
[null,null,null,0,null,null,null,null,0]
[null,null,null,0,null,null,null,null,0]
[null,null,null,0,null,null,null,null,0]
[null,null,null,0,null,null,null,null,0]
[null,null,null,0,null,null,null,null,0]
[null,null,null,0,null,null,null,null,0]
[null,null,null,0,null,null,null,null,0]
[null,null,null,0,null,null,null,null,0]
[null,null,null,0,null,null,null,null,0]
[null,null,null,0,null,null,null,null,0]
[null,null,null,0,null,null,null,null,0]
[null,null,null,0,null,null,null,null,0]
[null,null,null,0,null,null,null,null,0]
[null,null,null,0,null,null,null,null,0]
[null,null,null,0,null,null,null,null,0]
[null,null,null,0,null,null,null,null,0]
[null,null,null,0,null,null,null,null,0]
[null,null,null,0,null,null,null,null,0]
[null,null,null,0,null,null,null,null,0]
[null,null,null,0,null,null,null,null,0]
[null,null,null,0,null,null,null,null,0]
[null,null,null,0,null,null,null,null,0]
[null,null,null,0,null,null,null,null,0]
[null,null,null,0,null,null,null,null,0]
[null,null,null,0,null,null,null,null,0]
[null,null,null,0,null,null,null,null,0]
[null,null,null,0,null,null,null,null,0]
[null,null,null,0,null,null,null,null,0]
[null,null,null,0,null,null,null,null,0]
[null,null,null,0,null,null,null,null,0]
[null,null,null,0,null,null,null,null,0]
[null,null,null,0,null,null,null,null,0]
[null,null,null,0,null,null,null,null,0]
[null,null,null,0,null,null,null,null,0]
[null,null,null,0,null,null,null,null,0]
[null,null,null,0,null,null,null,null,0]
[null,null,null,0,null,null,null,null,0]
[null,null,null,0,null,null,null,null,0]
[null,null,null,0,null,null,null,null,0]
[null,null,null,0,null,null,null,null,0]
[null,null,null,0,null,null,null,null,0]
[null,null,null,0,null,null,null,null,0]
[null,null,null,0,null,null,null,null,0]
[null,null,null,0,null,null,null,null,0]
[null,null,null,0,null,null,null,null,0]
[null,null,null,0,null,null,null,null,0]
[null,null,null,0,null,null,null,null,0]
[null,null,null,0,null,null,null,null,0]
[null,null,null,0,null,null,null,null,0]
[null,null,null,0,null,null,null,null,0]
[null,null,null,0,null,null,null,null,0]
[null,null,null,0,null,null,null,null,0]
[null,null,null,0,null,null,null,null,0]
[null,null,null,0,null,null,null,null,0]
[null,null,null,0,null,null,null,null,0]
[null,null,null,0,null,null,null,null,0]
[null,null,null,0,null,null,null,null,0]
[null,null,null,{"$f":"IF(C259=\"Yes\",B259,0)","v":0},null,null,null,null,{"$f":"IF(LEN(H259)=0,G259,H259)","v":0}]
[null,null,null,0,null,null,null,null,0]
[null,null,null,0,null,null,null,null,0]
[null,null,null,0,null,null,null,null,0]
[null,null,null,0,null,null,null,null,0]
[null,null,null,0,null,null,null,null,0]
[null,null,null,0,null,null,null,null,0]
[null,null,null,0,null,null,null,null,0]
[null,null,null,0,null,null,null,null,0]
[null,null,null,0,null,null,null,null,0]
[null,null,null,0,null,null,null,null,0]
[null,null,null,0,null,null,null,null,0]
[null,null,null,0,null,null,null,null,0]
[null,null,null,0,null,null,null,null,0]
[null,null,null,0,null,null,null,null,0]
[null,null,null,0,null,null,null,null,0]
[null,null,null,0,null,null,null,null,0]
[null,null,null,0,null,null,null,null,0]
[null,null,null,0,null,null,null,null,0]
[null,null,null,0,null,null,null,null,0]
[null,null,null,0,null,null,null,null,0]
[null,null,null,0,null,null,null,null,0]
[null,null,null,0,null,null,null,null,0]
[null,null,null,0,null,null,null,null,0]
[null,null,null,0,null,null,null,null,0]
[null,null,null,0,null,null,null,null,0]
[null,null,null,0,null,null,null,null,0]
[null,null,null,0,null,null,null,null,0]
[null,null,null,0,null,null,null,null,0]
[null,null,null,0,null,null,null,null,0]
[null,null,null,0,null,null,null,null,0]
[null,null,null,0,null,null,null,null,0]
[null,null,null,0,null,null,null,null,0]
[null,null,null,0,null,null,null,null,0]
[null,null,null,0,null,null,null,null,0]
[null,null,null,0,null,null,null,null,0]
[null,null,null,0,null,null,null,null,0]
[null,null,null,0,null,null,null,null,0]
[null,null,null,0,null,null,null,null,0]
[null,null,null,0,null,null,null,null,0]
[null,null,null,0,null,null,null,null,0]
[null,null,null,0,null,null,null,null,0]
[null,null,null,0,null,null,null,null,0]
[null,null,null,0,null,null,null,null,0]
[null,null,null,0,null,null,null,null,0]
[null,null,null,0,null,null,null,null,0]
[null,null,null,0,null,null,null,null,0]
[null,null,null,0,null,null,null,null,0]
[null,null,null,0,null,null,null,null,0]
[null,null,null,0,null,null,null,null,0]
[null,null,null,0,null,null,null,null,0]
[null,null,null,0,null,null,null,null,0]
[null,null,null,0,null,null,null,null,0]
[null,null,null,0,null,null,null,null,0]
[null,null,null,0,null,null,null,null,0]
[null,null,null,0,null,null,null,null,0]
[null,null,null,0,null,null,null,null,0]
[null,null,null,0,null,null,null,null,0]
[null,null,null,0,null,null,null,null,0]
[null,null,null,0,null,null,null,null,0]
[null,null,null,0,null,null,null,null,0]
[null,null,null,0,null,null,null,null,0]
[null,null,null,0,null,null,null,null,0]
[null,null,null,0,null,null,null,null,0]
[null,null,null,{"$f":"IF(C323=\"Yes\",B323,0)","v":0},null,null,null,null,{"$f":"IF(LEN(H323)=0,G323,H323)","v":0}]
[null,null,null,0,null,null,null,null,0]
[null,null,null,0,null,null,null,null,0]
[null,null,null,0,null,null,null,null,0]
[null,null,null,0,null,null,null,null,0]
[null,null,null,0,null,null,null,null,0]
[null,null,null,0,null,null,null,null,0]
[null,null,null,0,null,null,null,null,0]
[null,null,null,0,null,null,null,null,0]
[null,null,null,0,null,null,null,null,0]
[null,null,null,0,null,null,null,null,0]
[null,null,null,0,null,null,null,null,0]
[null,null,null,0,null,null,null,null,0]
[null,null,null,0,null,null,null,null,0]
[null,null,null,0,null,null,null,null,0]
[null,null,null,0,null,null,null,null,0]
[null,null,null,0,null,null,null,null,0]
[null,null,null,0,null,null,null,null,0]
[null,null,null,0,null,null,null,null,0]
[null,null,null,0,null,null,null,null,0]
[null,null,null,0,null,null,null,null,0]
[null,null,null,0,null,null,null,null,0]
[null,null,null,0,null,null,null,null,0]
[null,null,null,0,null,null,null,null,0]
[null,null,null,0,null,null,null,null,0]
[null,null,null,0,null,null,null,null,0]
[null,null,null,0,null,null,null,null,0]
[null,null,null,0,null,null,null,null,0]
[null,null,null,0,null,null,null,null,0]
[null,null,null,0,null,null,null,null,0]
[null,null,null,0,null,null,null,null,0]
[null,null,null,0,null,null,null,null,0]
[null,null,null,0,null,null,null,null,0]
[null,null,null,0,null,null,null,null,0]
[null,null,null,0,null,null,null,null,0]
[null,null,null,0,null,null,null,null,0]
[null,null,null,0,null,null,null,null,0]
[null,null,null,0,null,null,null,null,0]
[null,null,null,0,null,null,null,null,0]
[null,null,null,0,null,null,null,null,0]
[null,null,null,0,null,null,null,null,0]
[null,null,null,0,null,null,null,null,0]
[null,null,null,0,null,null,null,null,0]
[null,null,null,0,null,null,null,null,0]
[null,null,null,0,null,null,null,null,0]
[null,null,null,0,null,null,null,null,0]
[null,null,null,0,null,null,null,null,0]
[null,null,null,0,null,null,null,null,0]
[null,null,null,0,null,null,null,null,0]
[null,null,null,0,null,null,null,null,0]
[null,null,null,0,null,null,null,null,0]
[null,null,null,0,null,null,null,null,0]
[null,null,null,0,null,null,null,null,0]
[null,null,null,0,null,null,null,null,0]
[null,null,null,0,null,null,null,null,0]
[null,null,null,0,null,null,null,null,0]
[null,null,null,0,null,null,null,null,0]
[null,null,null,0,null,null,null,null,0]
[null,null,null,0,null,null,null,null,0]
[null,null,null,0,null,null,null,null,0]
[null,null,null,0,null,null,null,null,0]
[null,null,null,0,null,null,null,null,0]
[null,null,null,0,null,null,null,null,0]
[null,null,null,0,null,null,null,null,0]
[null,null,null,{"$f":"IF(C387=\"Yes\",B387,0)","v":0},null,null,null,null,{"$f":"IF(LEN(H387)=0,G387,H387)","v":0}]
[null,null,null,0,null,null,null,null,0]
[null,null,null,0,null,null,null,null,0]
[null,null,null,0,null,null,null,null,0]
[null,null,null,0,null,null,null,null,0]
[null,null,null,0,null,null,null,null,0]
[null,null,null,0,null,null,null,null,0]
[null,null,null,0,null,null,null,null,0]
[null,null,null,0,null,null,null,null,0]
[null,null,null,0,null,null,null,null,0]
[null,null,null,0,null,null,null,null,0]
[null,null,null,0,null,null,null,null,0]
[null,null,null,0,null,null,null,null,0]
[null,null,null,0,null,null,null,null,0]
{"$rows_left_out":601}
{"sheet":"Standards","index":2,"n_rows":19,"n_cols":9,"rows_kept":19,"cut":false,"hidden":true,"merged":[]}
["Standard","No.","Description","NELP Building-Level Standard","Count","Hours","Req Hrs","Lead","Support"]
["NELP",1,"Mission, Vision, and Improvement",{"$f":"A2 & B2 & \":\" & C2","v":"NELP1:Mission, Vision, and Improvement"},{"$f":"COUNTIF(NELP_Log,Standards!D2)","v":1},{"$f":"SUMIF(NELP_Log,D2,Hours)","v":1},{"$f":"SUMIF(NELP_Log,D2,Req_Hours)","v":1},{"$f":"SUMIFS(Hours,NELP_Log,D2,Role,$H$1)","v":0},{"$f":"SUMIFS(Hours,NELP_Log,D2,Role,$I$1)","v":1}]
["NELP",2,"Ethics and Profesisonal Norms","NELP2:Ethics and Profesisonal Norms",{"$f":"COUNTIF(NELP_Log,Standards!D3)","v":1},{"$f":"SUMIF(NELP_Log,D3,Hours)","v":4},{"$f":"SUMIF(NELP_Log,D3,Req_Hours)","v":4},4,0]
["NELP",3,"Equity, Inclusiveness, and Cultural Responsiveness","NELP3:Equity, Inclusiveness, and Cultural Responsiveness",{"$f":"COUNTIF(NELP_Log,Standards!D4)","v":1},0.25,0.25,0.25,0]
["NELP",4,"Learning and Instruction","NELP4:Learning and Instruction",{"$f":"COUNTIF(NELP_Log,Standards!D5)","v":1},2,0,2,0]
["NELP",5,"Community and External Leadership","NELP5:Community and External Leadership",{"$f":"COUNTIF(NELP_Log,Standards!D6)","v":0},0,0,0,0]
["NELP",6,"Operations and Management","NELP6:Operations and Management",{"$f":"COUNTIF(NELP_Log,Standards!D7)","v":3},5.25,5.25,5.25,0]
["NELP",7,"Building Professional Capacity","NELP7:Building Professional Capacity",{"$f":"COUNTIF(NELP_Log,Standards!D8)","v":1},4,4,0,4]
["CCDEI",1,"Understanding Self and Others","CCDEI1:Understanding Self and Others",{"$f":"COUNTIF(WA_State_Log,Standards!D9)","v":0},{"$f":"SUMIF(WA_State_Log,D9,Hours)","v":0},{"$f":"SUMIF(WA_State_Log,D9,Req_Hours)","v":0},0,0]
["CCDEI",2,"Student, Family, and Community Engagement","CCDEI2:Student, Family, and Community Engagement",{"$f":"COUNTIF(WA_State_Log,Standards!D10)","v":1},4,4,0,0]
["CCDEI",3,"Learning Partnerships","CCDEI3:Learning Partnerships",{"$f":"COUNTIF(WA_State_Log,Standards!D11)","v":0},0,0,0,0]
["CCDEI",4,"Leading for Educational Equity","CCDEI4:Leading for Educational Equity",{"$f":"COUNTIF(WA_State_Log,Standards!D12)","v":0},0,0,0,0]
["SEL",1,"Self-Awareness","SEL1:Self-Awareness",{"$f":"COUNTIF(WA_State_Log,Standards!D13)","v":0},0,0,0,0]
["SEL",2,"Self-Management","SEL2:Self-Management",{"$f":"COUNTIF(WA_State_Log,Standards!D14)","v":1},0.25,0.25,0,0]
["SEL",3,"Self-Efficacy","SEL3:Self-Efficacy",{"$f":"COUNTIF(WA_State_Log,Standards!D15)","v":0},0,0,0,0]
["SEL",4,"Social Awareness","SEL4:Social Awareness",{"$f":"COUNTIF(WA_State_Log,Standards!D16)","v":0},0,0,0,0]
["SEL",5,"Social Management","SEL5:Social Management",{"$f":"COUNTIF(WA_State_Log,Standards!D17)","v":0},0,0,0,0]
["SEL",6,"Social Engagement","SEL6:Social Engagement",{"$f":"COUNTIF(WA_State_Log,Standards!D18)","v":1},4,4,0,0]
["STI",null,"Since Time Immemorial","STI:Since Time Immemorial",{"$f":"COUNTIF(WA_State_Log,Standards!D19)","v":1},2,0,0,0]